practice,place,plant,part,isolate,morfotype,dish,sequence,MatchUNITE,identityUNITE,lengthUNITE,lineageUNITE,speciesUNITE,genusUNITE,identityNCBI,MatchNCBI,speciesNCBI,genusNCBI,lengthNCBI,species,genus,identity,blastlength,seqlength,family,order,class,phylum,fragment,part2,medium,bengal
1,11,111,111L,111L15,,6well,GAATGGGGTTGTTTTACGGCGTAGCCTCCCGAACACCCTTTAGCGAATAGTTTCCACAACGCTTAGGGGACAGAAGACCCAGCCGGTCGATTTGAGGCACGCGGCGGACCGCGTTGCCCAATACCAAGCGAGGCTTGAGTGGTGAAATGACGCTCGAACAGGCATGCCCCCCGGAATACCAGGGGGCGCAATGTGCGTTCAAAGATTCGATGATTCACTGAATTCTGCAATTCACATTACTTATCGCATTTCGCTGCGTTCTTCATCGATGCCAGAACCAAGAGATCCGTTGTTAAAAGTTTTAATTTATTAATTAAGTTTACTCAGACTGCAAAGTTACGCAAGAGTTTGAAGTGTCCACCCGGAGCCCCCGCCCGAAGGCAGGGTCGCCCCGGAGGCAACAGAGTCGGACAACAAAGGGTTATGAACATCCCGGTGGTTAGACCGGGGTCACTTGTAATGATCCCTCCGCAGGTTCACCTACGGAA,Ascomycota_sp|JQ246357|SH217942.07FU|reps|k__Fungi;p__Ascomycota;c__unidentified;o__unidentified;f__unidentified;g__unidentified;s__Ascomycota_sp,99.789,474,k__Fungi;p__Ascomycota;c__unidentified;o__unidentified;f__unidentified;g__unidentified;s__Ascomycota_sp,Ascomycota_sp,unidentified,100,NR_119837.1 Cladosporium australiense CPC 13226 ITS region; from TYPE material,Cladosporium_australiense,Cladosporium,486,Cladosporium_australiense,Cladosporium,100,486,488,Davidiellaceae,Capnodiales,Dothideomycetes,Ascomycota,111L15,L,PDA,bengal
1,11,111,111L,111L162,M11,6well,AATGGGGTTGTTTTACGGCGTAGCCTCCCGAACACCCTTTAGCGAATAGTTTCCACAACGCTTAGGGGACAGAAGACCCAGCCGGTCGATTTGAGGCACGCGGCGGACCGCGTTGCCCAATACCAAGCGAGGCTTGAGTGGTGAAATGACGCTCGAACAGGCATGCCCCCCGGAATACCAGGGGGCGCAATGTGCGTTCAAAGATTCGATGATTCACTGAATTCTGCAATTCACATTACTTATCGCATTTCGCTGCGTTCTTCATCGATGCCAGAACCAAGAGATCCGTTGTTAAAAGTTTTAATTTATTAATTAAGTTTACTCAGACTGCAAAGTTACGCAAGAGTTTGAAGTGTCCACCCGGAGCCCCCGCCCGAAGGCAGGGTCGCCCCGGAGGCAACAGAGTCGGACAACAAAGGGTTATGAACATCCCGGTGGTTAGACCGGGGTCACTTGTAATGATCCATCCGCAGGTTCACCCTACGGAA,Ascomycota_sp|JQ246357|SH217942.07FU|reps|k__Fungi;p__Ascomycota;c__unidentified;o__unidentified;f__unidentified;g__unidentified;s__Ascomycota_sp,99.578,474,k__Fungi;p__Ascomycota;c__unidentified;o__unidentified;f__unidentified;g__unidentified;s__Ascomycota_sp,Ascomycota_sp,unidentified,99.589,NR_119837.1 Cladosporium australiense CPC 13226 ITS region; from TYPE material,Cladosporium_australiense,Cladosporium,487,Cladosporium_australiense,Cladosporium,99.589,487,488,Davidiellaceae,Capnodiales,Dothideomycetes,Ascomycota,111L16,L,AMM,bengal
1,11,111,111L,111L221,,6well,AATGTACTTTTTGGACGTCGTCGTTATGAGTGCAAAGCGCGAGATGTACTGCGCTCCGAAATCAATACGCCGGCTGCCAATTGTTTTGAGGCGAGTCTGCGCGCAGAGGCGAGACAAACACCCAACACCAAGCAAAGCTTGAAGGTACAAATGACGCTCGAACAGGCATGCCCCATGGAATACCAAGGGGCGCAATGTGCGTTCAAAGATTCGATGATTCACTGAATTCTGCAATTCACACTACTTATCGCATTTCGCTGCGTTCTTCATCGATGCCAGAACCAAGAGATCCGTTGTTGAAAGTTGTAACTATTAAGTTTTTTCAGACGCTGATTTCAATTACAAAGGGTTTAAGTTTTGTCCAATCGGCGGGCGGACCCGCCGAGGAAACGAAGGTACTCAAAAGACATGGGTAAGAGATGGCAGGCAAAGCCCGCAACTCTAGGTAATGATCCTTCCGCAGGTTCACCTACGGAA,Stagonosporopsis_dorenboschii|GU237862|SH345969.07FU|refs|k__Fungi;p__Ascomycota;c__Dothideomycetes;o__Pleosporales;f__Pleosporales_fam_Incertae_sedis;g__Stagonosporopsis;s__Stagonosporopsis_dorenboschii,99.558,453,k__Fungi;p__Ascomycota;c__Dothideomycetes;o__Pleosporales;f__Pleosporales_fam_Incertae_sedis;g__Stagonosporopsis;s__Stagonosporopsis_dorenboschii,Stagonosporopsis_dorenboschii,Stagonosporopsis,99.558,NR_135996.1 Stagonosporopsis dorenboschii CBS 426.90 ITS region; from TYPE material,Stagonosporopsis_dorenboschii,Stagonosporopsis,453,Stagonosporopsis_dorenboschii,Stagonosporopsis,99.558,453,477,Pleosporales_fam_Incertae_sedis,Pleosporales,Dothideomycetes,Ascomycota,111L22,L,PDA,none
1,11,111,111L,111L22,M25,6well,AAGGCTTAATGGATGCTAGACCTTTGCTGATAGAGAGTGCGACTTGTGCTGCGCTCCGAAACCAGTAGGCCGGCTGCCAATTACTTTAAGGCGAGTCTCCAGCAAAGCTAGAGACAAGACGCCCAACACCAAGCAAAGCTTGAGGGTACAAATGACGCTCGAACAGGCATGCCCTTTGGAATACCAAAGGGCGCAATGTGCGTTCAAAGATTCGATGATTCACTGAATTCTGCAATTCACACTACTTATCGCATTTCGCTGCGTTCTTCATCGATGCCAGAACCAAGAGATCCGTTGTTGAAAGTTGTAATTATTAATTTGTTACTGACGCTGATTGCAATTACAAAAGGTTTATGTTTGTCCTAGTGGTGGGCGAACCCACCAAGGAAACAAGAAGTACGCAAAAGACAAGGGTGAATAATTCAGCAAGGCTGTAACCCCGAGAGGTTCCAGCCCGCCTTCATATTTGTGTAAGAAAACCTCCGCAGGTTCACCCTACGGAA,Alternaria_alternata|KF465761|SH429908.07FU|refs|k__Fungi;p__Ascomycota;c__Dothideomycetes;o__Pleosporales;f__Pleosporaceae;g__Alternaria;s__Alternaria_alternata,100,471,k__Fungi;p__Ascomycota;c__Dothideomycetes;o__Pleosporales;f__Pleosporaceae;g__Alternaria;s__Alternaria_alternata,Alternaria_alternata,Alternaria,99.004,NR_131316.1 Alternaria alternata CBS 916.96 ITS region; from verified material,Alternaria_alternata,Alternaria,502,Alternaria_alternata,Alternaria,100,471,503,Pleosporaceae,Pleosporales,Dothideomycetes,Ascomycota,111L22,L,PDA,none
1,11,111,111L,111L23,M21,6well,GAAGTTGGGGTTTAACGGCGTGGCCGCGACGATTACCAGTAACGAGGGTTTTACTACTACGCTATGGAAGCTCGACGTGACCGCCAATCAATTTGAGGAACGCGAATTAACGCGAGTCCCAACACCAAGCTGTGCTTGAGGGTTGAAATGACGCTCGAACAGGCATGCCCGCCAGAATACTGGCGGGCGCAATGTGCGTTCAAAGATTCGATGATTCACTGAATTCTGCAATTCACATTACTTATCGCATTTTGCTGCGTTCTTCATCGATGCCAGAACCAAGAGATCCGTTGTTGAAAGTTTTGATTTATTTATGGTTTTACTCAGAAGTTACATATAGAAACAGAGTTTAGGGGTCCTCTGGCGGGCCGTCCCGTTTTACCGGGAGCGGGCTGATCCGCCGAGGCAACAAGTGGTATGTTCACAGGGGTTTGGGAGCT,Ascomycota_sp|HF566400|SH195288.07FU|reps|k__Fungi;p__Ascomycota;c__unidentified;o__unidentified;f__unidentified;g__unidentified;s__Ascomycota_sp,100,438,k__Fungi;p__Ascomycota;c__unidentified;o__unidentified;f__unidentified;g__unidentified;s__Ascomycota_sp,Ascomycota_sp,unidentified,98.636,NR_120263.1 Fusarium circinatum CBS 405.97 ITS region; from TYPE material,Fusarium_circinatum,Fusarium,440,Fusarium_circinatum,Fusarium,98.636,440,440,Nectriaceae,Hypocreales,Sordariomycetes,Ascomycota,111L23,L,AMM,none
1,11,111,111L,111L2a1,,RPD,,,,,,,,,,,,,,,,,,,,,,111L2a,L,PDA,none
1,11,111,111L,111L2a2,,RPD,AAGGCTTAATGGATGCTAGACCTTTGCTGATAGAGAGTGCGACTTGTGCTGCGCTCCGAAACCAGTAGGCCGGCTGCCAATTACTTTAAGGCGAGTCTCCAGCAAAGCTAGAGACAAGACGCCCAACACCAAGCAAAGCTTGAGGGTACAAATGACGCTCGAACAGGCATGCCCTTTGGAATACCAAAGGGCGCAATGTGCGTTCAAAGATTCGATGATTCACTGAATTCTGCAATTCACACTACTTATCGCATTTCGCTGCGTTCTTCATCGATGCCAGAACCAAGAGATCCGTTGTTGAAAGTTGTAATTATTAATTTGTTACTGACGCTGATTGCAATTACAAAAGGTTTATGTTTGTCCTAGTGGTGGGCGAACCCACCAAGGAAACAAGAAGTACGCAAAAGACAAGGGTGAATAATTCAGCAAGGCTGTAACCCCGAGAGGTTCCAGCCCGCCTTCATATTTGTGTAATGATCCCTCCGCAGGTTCACCCTACGGAA,Alternaria_alternata|KF465761|SH429908.07FU|refs|k__Fungi;p__Ascomycota;c__Dothideomycetes;o__Pleosporales;f__Pleosporaceae;g__Alternaria;s__Alternaria_alternata,100,471,k__Fungi;p__Ascomycota;c__Dothideomycetes;o__Pleosporales;f__Pleosporaceae;g__Alternaria;s__Alternaria_alternata,Alternaria_alternata,Alternaria,99.801,NR_131316.1 Alternaria alternata CBS 916.96 ITS region; from verified material,Alternaria_alternata,Alternaria,502,Alternaria_alternata,Alternaria,100,471,503,Pleosporaceae,Pleosporales,Dothideomycetes,Ascomycota,111L2a,L,PDA,none
1,11,111,111L,111L32,M10,6well,,,,,,,,,,,,,,,,,,,,,,111L32,L,PDA,none
1,11,111,111L,111L33,M10,6well,GCCGAAGCGGGCTTGTGGGGGGTTTAGAGGCAGGACGCCGAGGACTCCCGATGCGAGGCGAATGCTACTGCGCAAAGGAGAGGGCCCTTCGGGTCCGCCACTGGTTTTAGGGGCCTGCCGTGGCAGATCCCCAACGCCGGGCCACAGGGGCTCGAGGGTTGAAACGACGCTCGGACAGGCATGCCTCCCAGGATACTGGAAGGCGCCATGTGCGTTCAAAGATTCGATGATTCACTGAATTCTGCAATTCACATTACATATCGCGTTTCGCTGCGTTCTTCATCGATGCTGGAGCCAAGAGATCCGTTGTTAAAAGTTTTGACAGTTCGCTAAGAACACTCAGAAGTATCGTCGGGTTCGAAAACAGAGATTCTGATGAGACCGGCGGGCACCCTTGCGGGCGCCGCCGAAGCAACAGGTATAATAGTTCACAAAGGGTAGAGAGTGTAGTACTCAGTAATGATCACCTCCGCAGGTTCACCTACGGGA,Monographella_cucumerina|KM265891|SH527845.07FU|reps|k__Fungi;p__Ascomycota;c__Sordariomycetes;o__Xylariales;f__Xylariales_fam_Incertae_sedis;g__Monographella;s__Monographella_cucumerina,99.583,480,k__Fungi;p__Ascomycota;c__Sordariomycetes;o__Xylariales;f__Xylariales_fam_Incertae_sedis;g__Monographella;s__Monographella_cucumerina,Monographella_cucumerina,Monographella,97.817,NR_132793.1 Plectosphaerella oratosquillae IFM 56765 ITS region; from TYPE material,Plectosphaerella_oratosquillae,Plectosphaerella,458,Monographella_cucumerina,Monographella,99.583,480,489,Xylariales_fam_Incertae_sedis,Xylariales,Sordariomycetes,Ascomycota,111L33,L,AMM,none
1,11,111,111L,111L34,M12,6well,TTTCAGAAGTTGGGTGTTTTACGGACGTGGACGCGCCGCGCTCCCGGTGCGAGTTGTGCAAACTACTGCGCAGGAGAGGCTGCGGCGAGACCGCCACTGTATTTCGGGGCCGGGATCCCGTCTTAGGGGCTCCCGAGGTCCCCAACGCCGACCCCCCGGAGGGGTTCGAGGGTTGAAATGACGCTCGGACAGGCATGCCCGCCAGAATACTGGCGGGCGCAATGTGCGTTCAAAGATTCGATGATTCACTGAATTCTGCAATTCACATTACTTATCGCATTTCGCTGCGTTCTTCATCGATGCCAGAACCAAGAGATCCGTTGTTGAAAGTTTTGATTCATTTTGAATTTTTGCTCAGAGCTGTAAGAAATAACGTCCGCGAGGGGACTACAGAAAAGAGTTTGGTTGGTCCCTCCGGCGGGCGCCTGGTTCCGGGGCTGCGACGCACCCGGGGCGTGACCCCGCCGAGGCAACAGTTTGGTATGGTTCACATTGGGTTTGGGAGTTGT,Trichoderma_atroviride|JN943356|SH187755.07FU|refs|k__Fungi;p__Ascomycota;c__Sordariomycetes;o__Hypocreales;f__Hypocreaceae;g__Trichoderma;s__Trichoderma_atroviride,100,509,k__Fungi;p__Ascomycota;c__Sordariomycetes;o__Hypocreales;f__Hypocreaceae;g__Trichoderma;s__Trichoderma_atroviride,Trichoderma_atroviride,Trichoderma,100,NR_077207.1 Trichoderma atroviride NBRC 101776 ITS region; from synonym TYPE material,Trichoderma_atroviride,Trichoderma,509,Trichoderma_atroviride,Trichoderma,100,509,509,Hypocreaceae,Hypocreales,Sordariomycetes,Ascomycota,111L34,L,SA,bengal
1,11,111,111L,111L3b2,M11,RPD,AATGGGGTTGTTTTACGGCGTAGCCTCCCGAACACCCTTTAGCGAATAGTTTCCACAACGCTTAGGGGACAGAAGACCCAGCCGGTCGATTTGAGGCACGCGGCGGACCGCGTTGCCCAATACCAAGCGAGGCTTGAGTGGTGAAATGACGCTCGAACAGGCATGCCCCCCGGAATACCAGGGGGCGCAATGTGCGTTCAAAGATTCGATGATTCACTGAATTCTGCAATTCACATTACTTATCGCATTTCGCTGCGTTCTTCATCGATGCCAGAACCAAGAGATCCGTTGTTAAAAGTTTTAATTTATTAATTAAGTTTACTCAGACTGCAAAGTTACGCAAGAGTTTGAAGTGTCCACCCGGAGCCCCCGCCCGAAGGCAGGGTCGCCCCGGAGGCAACAGAGTCGGACAACAAAGGGTTATGAACATCCCGGTGGTTAGACCGGGGTCACTTGTAATGATCCCTCCGCAGGTTCACCTACGGAA,Ascomycota_sp|JQ246357|SH217942.07FU|reps|k__Fungi;p__Ascomycota;c__unidentified;o__unidentified;f__unidentified;g__unidentified;s__Ascomycota_sp,99.789,474,k__Fungi;p__Ascomycota;c__unidentified;o__unidentified;f__unidentified;g__unidentified;s__Ascomycota_sp,Ascomycota_sp,unidentified,100,NR_119837.1 Cladosporium australiense CPC 13226 ITS region; from TYPE material,Cladosporium_australiense,Cladosporium,486,Cladosporium_australiense,Cladosporium,100,486,487,Davidiellaceae,Capnodiales,Dothideomycetes,Ascomycota,111L3b,L,PDA,none
1,11,111,111R,111R121,,6well,GAAGTTGGGGGTTTAACGGCAGGGCACCGCCAGGGCCTTCCAGAACGAAATATAATTACTACGCTCGGGGTCCTGGCGAGCTCGCCACTAGATTTCAGGGCCCGCCCTTTTACAGGCGGTGCCCCAACACCAAGCAGTGCTTGAGGGTTGAAATGACGCTCGAACAGGCATGCCCTCCGGAATACCAGAGGGCGCAATGTGCGTTCAAAGATTCGATGATTCACTGAATTCTGCAATTCACATTACTTATCGCATTTCGCTGCGTTCTTCATCGATGCCAGAACCAAGAGATCCGTTGTTGAAAGTTTTGATTCATTTATGTTTTTTACTCAGAGATCCACTAAGAAACAAGAGTCTGGTTGGCCGCCGGCGGGCTGCTCCTCGTTTCCGAGGGGCCTCAGTGAGGCCGGCCTGCGCCGAGGCAACAGTAAGGTATAAGTTCACAAAGGGTTTCTGGGTGCGCCGAAGCGCGTTCCAGCAATGATCCCTCAGCAGGTTCACCCTACGGAA,Ascomycota_sp|KC007266|SH185508.07FU|reps|k__Fungi;p__Ascomycota;c__unidentified;o__unidentified;f__unidentified;g__unidentified;s__Ascomycota_sp,99.375,480,k__Fungi;p__Ascomycota;c__unidentified;o__unidentified;f__unidentified;g__unidentified;s__Ascomycota_sp,Ascomycota_sp,unidentified,97.804,NR_111069.1 Diaporthe sclerotioides CBS 296.67 ITS region; from TYPE material,Diaporthe_sclerotioides,Diaporthe,501,Diaporthe_sclerotioides,Diaporthe,97.804,501,510,Diaporthaceae,Diaporthales,Sordariomycetes,Ascomycota,111R12,R,PDA,none
1,11,111,111R,111R122,,6well,GAAGTTGGGGGTTTAACGGCAGGGCACCGCCAGGGCCTTCCAGAACGAAATATAATTACTACGCTCGGGGTCCTGGCGAGCTCGCCACTAGATTTCAGGGCCCGCCCTTTTACAGGCGGTGCCCCAACACCAAGCAGTGCTTGAGGGTTGAAATGACGCTCGAACAGGCATGCCCTCCGGAATACCAGAGGGCGCAATGTGCGTTCAAAGATTCGATGATTCACTGAATTCTGCAATTCACATTACTTATCGCATTTCGCTGCGTTCTTCATCGATGCCAGAACCAAGAGATCCGTTGTTGAAAGTTTTGATTCATTTATGTTTTTTACTCAGAGATCCACTAAGAAACAAGAGTCTGGTTGGCCGCCGGCGGGCTGCTCCTCGTTTCCGAGGGGCCTCAGTGAGGCCGGCCTGCGCCGAGGCAACAGTAAGGTATAAGTTCACAAAGGGTTTCTGGGTGCGCCGCAGCGCGTTCCAGCAGATGAAACCCTCCGCAGGTTCACCTACGGAA,Ascomycota_sp|KC007266|SH185508.07FU|reps|k__Fungi;p__Ascomycota;c__unidentified;o__unidentified;f__unidentified;g__unidentified;s__Ascomycota_sp,99.167,480,k__Fungi;p__Ascomycota;c__unidentified;o__unidentified;f__unidentified;g__unidentified;s__Ascomycota_sp,Ascomycota_sp,unidentified,97.217,NR_111069.1 Diaporthe sclerotioides CBS 296.67 ITS region; from TYPE material,Diaporthe_sclerotioides,Diaporthe,503,Diaporthe_sclerotioides,Diaporthe,97.217,503,511,Diaporthaceae,Diaporthales,Sordariomycetes,Ascomycota,111R12,R,PDA,none
1,11,111,111R,111R13,,6well,TTGGGTTATGAAGGCTGTTTAACGGCCGGAACCCGCAGCACGCCCTTAGCGAGATAATACTACTACGCTCGGGGTGACAGCGAGCCCGCCACTGGTTTTCAGGGCCTGCGGACAGCCGCAGGTCCCCAACACAAGCCCGGGGCTTGATGGTTGAAATGACGCTCGGACAGGCATGCCCGCCAGAATACTGGCGGGCGCAATGTGCGTTCAAAGATTCGATGATTCACTGAATTCTGCAATTCACATTACTTATCGCATTTCGCTGCGTTCTTCATCGATGCCAGAACCAAGAGATCCGTTGTTGAAAGTTTTGACTTATTCAGTACAGAAGACTCAGAGAGGCCTTAAAATTATCAAGAGTTAGGTGACCTCCGGCGGGCGCCCCGCTAGGGGGCCCAGGGGCCCCGGGAGTGGTCCCGGGGCCGCCCGCCGAAGCAACGGTTAAAGGTAACGTTCACAATGGTTTGGGAGTTTTGCAACTCTGT,Sordariomycetes_sp|GU566296|SH195343.07FU|reps|k__Fungi;p__Ascomycota;c__Sordariomycetes;o__unidentified;f__unidentified;g__unidentified;s__Sordariomycetes_sp,99.793,484,k__Fungi;p__Ascomycota;c__Sordariomycetes;o__unidentified;f__unidentified;g__unidentified;s__Sordariomycetes_sp,Sordariomycetes_sp,unidentified,94.672,NR_144834.1 Chaetomium madrasense CBS 315.74 ITS region; from TYPE material,Chaetomium_madrasense,Chaetomium,488,Chaetomium_madrasense,Chaetomium,94.672,488,485,Chaetomiaceae,Sordariales,Sordariomycetes,Ascomycota,111R13,R,AMM,none
1,11,111,111R,111R141,,6well,,,,,,,,,,,,,,,,,,,,,,111R14,R,SA,bengal
1,11,111,111R,111R1411,M1,6well,GAAGTTGGGGTTTAACGGCGTGGCCGCGTCGATTACCAGTAACGATGTGTAAATTACTACGCTATGGAAGCTCGACGTGACCGCCAATCAATTTGGGGAGTGTTAACTAAAACAGCTCCCAACACCAAGCTGGGCTTGAGGGTTGAAATGACGCTCGAACAGGCATGCCCGCCAGAATACTGGCGGGCGCAATGTGCGTTCAAAGATTCGATGATTCACTGAATTCTGCAATTCACATTACTTATCGCATTTTGCTGCGTTCTTCATCGATGCCAGAACCAAGAGATCCGTTGTTGAAAGTTTTGATTTATTTGTTTTTTTACTCAGAAGTTCCACTAAAAACAGAGTTTAGGGGTCCTGCGGCGGGCCGTTCCGTGAGGAACGGGCTGATCCGCCGAGGCAACATAGAGGTATGTTCACAGGGGTTTGGGAGTTGTAAACTCGGTAAGAATCCCTCCGCAGGTTCACCTACGGAA,Nectriaceae_sp|FJ746660|SH215301.07FU|reps|k__Fungi;p__Ascomycota;c__Sordariomycetes;o__Hypocreales;f__Nectriaceae;g__unidentified;s__Nectriaceae_sp,100,445,k__Fungi;p__Ascomycota;c__Sordariomycetes;o__Hypocreales;f__Nectriaceae;g__unidentified;s__Nectriaceae_sp,Nectriaceae_sp,unidentified,94.606,NR_131313.1 Fusarium sporotrichioides UOA/HCPF 6G ITS region; from verified material,Fusarium_sporotrichioides,Fusarium,482,Fusarium_sporotrichioides,Fusarium,94.606,482,476,Nectriaceae,Hypocreales,Sordariomycetes,Ascomycota,111R14,R,SA,bengal
1,11,111,111R,111R1412,M14,6well,GAAGTTGGGGTTTTACGGCGTGGCCGCGACGATTACCAGTAACGAGGTGTATTATTACTACGCTATGGAAGCTCGACGTGACCGCCAATCGATTTGGGGAACGCGGGTTACCGCGAGTCCCAACACCAAGCTGAGCTTGAGGGTTGAAATGACGCTCGAACAGGCATGCCCGCCAGAATACTGGCGGGCGCAATGTGCGTTCAAAGATTCGATGATTCACTGAATTCTGCAATTCACATTACTTATCGCATTTTGCTGCGTTCTTCATCGATGCCAGAACCAAGAGATCCGTTGTTGAAAGTTTTGATTTATTTGTTTGTTTTACTCAGAAGTTCCACTAAAAACAGAGTTTAGGGTCCTCGGGCGGGCCGTCCCGTTTTACGGGGCGCGGGCTGATCCGCCGAGGCAACGTATAGGTATGTTCACAGGGGTTTGGGAGTTGTAAACTCGGTAAAGATCCCTCCGCAGGTTCACCTACGGAA,Nectriaceae_sp|JN983446|SH220702.07FU|reps|k__Fungi;p__Ascomycota;c__Sordariomycetes;o__Hypocreales;f__Nectriaceae;g__unidentified;s__Nectriaceae_sp,99.571,466,k__Fungi;p__Ascomycota;c__Sordariomycetes;o__Hypocreales;f__Nectriaceae;g__unidentified;s__Nectriaceae_sp,Nectriaceae_sp,unidentified,99.376,NR_121457.1 Fusarium equiseti NRRL 26419 ITS region; from TYPE material,Fusarium_equiseti,Fusarium,481,Fusarium_equiseti,Fusarium,99.376,481,482,Nectriaceae,Hypocreales,Sordariomycetes,Ascomycota,111R14,R,SA,bengal
1,11,111,111R,111R1421,M1,6well,TTGGGGTTTAACGGCGTGGCCGCGTCGATTACCAGTAACGATGTGTAAATTACTACGCTATGGAAGCTCGACGTGACCGCCAATCAATTTGGGGAGTGTTAACTAAAACAGCTCCCAACACCAAGCTGGGCTTGAGGGTTGAAATGACGCTCGAACAGGCATGCCCGCCAGAATACTGGCGGGCGCAATGTGCGTTCAAAGATTCGATGATTCACTGAATTCTGCAATTCACATTACTTATCGCATTTTGCTGCGTTCTTCATCGATGCCAGAACCAAGAGATCCGTTGTTGAAAGTTTTGATTTATTTGTTTTTTTACTCAGAAGTTCCACTAAAAACAGAGTTTAGGGGTCCTGCGGCGGGCCGTTCCGTGAGGAACGGGCTGATCCGCCGAGGCAACATAGAGGTATGTTCACAGGGGTTTGGGAGTTGTAAACTCGGTAATGATAAAAACCGCAGGTTCACCCTACGGAA,Nectriaceae_sp|FJ746660|SH215301.07FU|reps|k__Fungi;p__Ascomycota;c__Sordariomycetes;o__Hypocreales;f__Nectriaceae;g__unidentified;s__Nectriaceae_sp,100,441,k__Fungi;p__Ascomycota;c__Sordariomycetes;o__Hypocreales;f__Nectriaceae;g__unidentified;s__Nectriaceae_sp,Nectriaceae_sp,unidentified,94.08,NR_131313.1 Fusarium sporotrichioides UOA/HCPF 6G ITS region; from verified material,Fusarium_sporotrichioides,Fusarium,473,Fusarium_sporotrichioides,Fusarium,94.08,473,474,Nectriaceae,Hypocreales,Sordariomycetes,Ascomycota,111R14,R,SA,bengal
1,11,111,111R,111R142,,6well,,,,,,,,,,,,,,,,,,,,,,111R14,R,SA,bengal
1,11,111,111R,111R1422,M14,6well,GAAGTTGGGGTTTTACGGCGTGGCCGCGACGATTACCAGTAACGAGGTGTATTATTACTACGCTATGGAAGCTCGACGTGACCGCCAATCGATTTGGGGAACGCGGGTTACCGCGAGTCCCAACACCAAGCTGAGCTTGAGGGTTGAAATGACGCTCGAACAGGCATGCCCGCCAGAATACTGGCGGGCGCAATGTGCGTTCAAAGATTCGATGATTCACTGAATTCTGCAATTCACATTACTTATCGCATTTTGCTGCGTTCTTCATCGATGCCAGAACCAAGAGATCCGTTGTTGAAAGTTTTGATTTATTTGTTTGTTTTACTCAGAAGTTCCACTAAAAACAGAGTTTAGGGTCCTCGGGCGGGCCGTCCCGTTTTACGGGGCGCGGGCTGATCCGCCGAGGCAACGTATAGGTATGTTCACAGGGGTTTGGGAGTTGTAAACTCGGTAATGATCCCTCCGCAGGTTCACCCTACAGAA,Nectriaceae_sp|JN983446|SH220702.07FU|reps|k__Fungi;p__Ascomycota;c__Sordariomycetes;o__Hypocreales;f__Nectriaceae;g__unidentified;s__Nectriaceae_sp,99.785,466,k__Fungi;p__Ascomycota;c__Sordariomycetes;o__Hypocreales;f__Nectriaceae;g__unidentified;s__Nectriaceae_sp,Nectriaceae_sp,unidentified,99.789,NR_121457.1 Fusarium equiseti NRRL 26419 ITS region; from TYPE material,Fusarium_equiseti,Fusarium,475,Fusarium_equiseti,Fusarium,99.789,475,483,Nectriaceae,Hypocreales,Sordariomycetes,Ascomycota,111R14,R,SA,bengal
1,11,111,111R,111R1423,M15,6well,GAAGTTGGGGTTTTACGGCGTGGCCGCGACGATTACCAGTAACGAGGTGTATTATTACTACGCTATGGAAGCTCGACGTGACCGCCAATCGATTTGGGGAACGCGGGTTACCGCGAGTCCCAACACCAAGCTGAGCTTGAGGGTTGAAATGACGCTCGAACAGGCATGCCCGCCAGAATACTGGCGGGCGCAATGTGCGTTCAAAGATTCGATGATTCACTGAATTCTGCAATTCACATTACTTATCGCATTTTGCTGCGTTCTTCATCGATGCCAGAACCAAGAGATCCGTTGTTGAAAGTTTTGATTTATTTGTTTGTTTTACTCAGAAGTTCCACTAAAAACAGAGTTTAGGGTCCTCGGGCGGGCCGTCCCGTTTTACGGGGCGCGGGCTGATCCGCCGAGGCAACGTATAGGTATGTTCACAGGGGTTTGGGAGTTGTAAACTCGGTAATGATCCCTCCGCAGGTTCACCCTACGGAA,Nectriaceae_sp|JN983446|SH220702.07FU|reps|k__Fungi;p__Ascomycota;c__Sordariomycetes;o__Hypocreales;f__Nectriaceae;g__unidentified;s__Nectriaceae_sp,99.785,466,k__Fungi;p__Ascomycota;c__Sordariomycetes;o__Hypocreales;f__Nectriaceae;g__unidentified;s__Nectriaceae_sp,Nectriaceae_sp,unidentified,99.789,NR_121457.1 Fusarium equiseti NRRL 26419 ITS region; from TYPE material,Fusarium_equiseti,Fusarium,475,Fusarium_equiseti,Fusarium,99.789,475,483,Nectriaceae,Hypocreales,Sordariomycetes,Ascomycota,111R14,R,SA,bengal
1,11,111,111R,111R143,M14,6well,GAAGTTGGGGTTTTACGGCGTGGCCGCGACGATTACCAGTAACGAGGTGTATTATTACTACGCTATGGAAGCTCGACGTGACCGCCAATCGATTTGGGGAACGCGGGTTACCGCGAGTCCCAACACCAAGCTGAGCTTGAGGGTTGAAATGACGCTCGAACAGGCATGCCCGCCAGAATACTGGCGGGCGCAATGTGCGTTCAAAGATTCGATGATTCACTGAATTCTGCAATTCACATTACTTATCGCATTTTGCTGCGTTCTTCATCGATGCCAGAACCAAGAGATCCGTTGTTGAAAGTTTTGATTTATTTGTTTGTTTTACTCAGAAGTTCCACTAAAAACAGAGTTTAGGGTCCTCGGGCGGGCCGTCCCGTTTTACGGGGCGCGGGCTGATCCGCCGAGGCAACGTATAGGTATGTTCACAGGGGTTTGGGAGTTGTAAACTCGGTAATGATCCCTCCGCAGGTTCACCCTACGGAA,Nectriaceae_sp|JN983446|SH220702.07FU|reps|k__Fungi;p__Ascomycota;c__Sordariomycetes;o__Hypocreales;f__Nectriaceae;g__unidentified;s__Nectriaceae_sp,99.785,466,k__Fungi;p__Ascomycota;c__Sordariomycetes;o__Hypocreales;f__Nectriaceae;g__unidentified;s__Nectriaceae_sp,Nectriaceae_sp,unidentified,99.789,NR_121457.1 Fusarium equiseti NRRL 26419 ITS region; from TYPE material,Fusarium_equiseti,Fusarium,475,Fusarium_equiseti,Fusarium,99.789,475,483,Nectriaceae,Hypocreales,Sordariomycetes,Ascomycota,111R14,R,SA,bengal
1,11,111,111R,111R2211,M21,6well,GTTGGGGTTTAACGGCGTGGCCGCGACGATTACCAGTAACGAGGGTTTTACTACTACGCTATGGAAGCTCGACGTGACCGCCAATCAATTTGAGGAACGCGAATTAACGCGAGTCCCAACACCAAGCTGTGCTTGAGGGTTGAAATGACGCTCGAACAGGCATGCCCGCCAGAATACTGGCGGGCGCAATGTGCGTTCAAAGATTCGATGATTCACTGAATTCTGCAATTCACATTACTTATCGCATTTTGCTGCGTTCTTCATCGATGCCAGAACCAAGAGATCCGTTGTTGAAAGTTTTGATTTATTTATGGTTTTACTCAGAAGTTACATATAGAAACAGAGTTTAGGGGTCCTCTGGCGGGCCGTCCCGTTTTACCGGGAGCGGGCTGATCCGCCGAGGCAACAAGTGGTATGTTCACAGGGGTTTGGGAGTTGTAAACTCGG,Ascomycota_sp|HF566400|SH195288.07FU|reps|k__Fungi;p__Ascomycota;c__unidentified;o__unidentified;f__unidentified;g__unidentified;s__Ascomycota_sp,100,447,k__Fungi;p__Ascomycota;c__unidentified;o__unidentified;f__unidentified;g__unidentified;s__Ascomycota_sp,Ascomycota_sp,unidentified,98.664,NR_120263.1 Fusarium circinatum CBS 405.97 ITS region; from TYPE material,Fusarium_circinatum,Fusarium,449,Fusarium_circinatum,Fusarium,98.664,449,447,Nectriaceae,Hypocreales,Sordariomycetes,Ascomycota,111R22,R,PDA,none
1,11,111,111R,111R2212,M21,6well,,,,,,,,,,,,,,,,,,,,,,111R22,R,PDA,none
1,11,111,111R,111R2221,M11,6well,TGGGGTTGTTTTACGGCGTAGCCTCCCGAACACCCTTTAGCGAATAGTTTCCACAACGCTTAGGGGACAGAAGACCCAGCCGGTCGATTTGAGGCACGCGGCGGACCGCGTTGCCCAATACCAAGCGAGGCTTGAGTGGTGAAATGACGCTCGAACAGGCATGCCCCCCGGAATACCAGGGGGCGCAATGTGCGTTCAAAGATTCGATGATTCACTGAATTCTGCAATTCACATTACTTATCGCATTTCGCTGCGTTCTTCATCGATGCCAGAACCAAGAGATCCGTTGTTAAAAGTTTTAATTTATTAATTAAGTTTACTCAGACTGCAAAGTTACGCAAGAGTTTGAAGTGTCCACCCGGAGCCCCCGCCCGAAGGCAGGGTCGCCCCGGAGGCAACAGAGTCGGACAAC,Cladosporium_exasperatum|HM148090|SH422672.07FU|refs|k__Fungi;p__Ascomycota;c__Dothideomycetes;o__Capnodiales;f__Davidiellaceae;g__Cladosporium;s__Cladosporium_exasperatum,99.757,412,k__Fungi;p__Ascomycota;c__Dothideomycetes;o__Capnodiales;f__Davidiellaceae;g__Cladosporium;s__Cladosporium_exasperatum,Cladosporium_exasperatum,Cladosporium,100,NR_111270.1 Cladosporium silenes CBS 109082 ITS region; from TYPE material,Cladosporium_silenes,Cladosporium,412,Cladosporium_exasperatum,Cladosporium,99.757,412,412,Davidiellaceae,Capnodiales,Dothideomycetes,Ascomycota,111R22,R,PDA,none
1,11,111,111R,111R2222,M11,6well,,,,,,,,,,,,,,,,,,,,,,111R22,R,PDA,none
1,11,111,111R,111R261,,6well,GAAGTTGGGGTTTTACGGCATGGCCGCGCCGCGTTCCAGTTGCGAGGTGTTAGCTACTACGCAATGGAGGCTGCAGCGAGACCGCCAATGTATTTCGGGGGCGGCGCCGCCCAGAAGGGCAGAGCCGATCCCCAACACCAAACCCGGGGGCTTGAGGGTTGAAATGACGCTCGAACAGGCATGCCCGCCGGAATACCAGCGGGCGCAATGTGCGTTCAAAGATTCGATGATTCACTGAATTCTGCAATTCACATTACTTATCGCATTTTGCTGCGTTCTTCATCGATGCCAGAACCAAGAGATCCGTTGTTGAAAGTTTTGATTTATTTGTTTGTTTTACTCAGAAGTTACAATAAGAAACATTAGAGTTTGGGTCCTCTGGCGGGCCGTCCCGTTTTACGGGGCGCGGGCTGATCCGCCGAGGCAACATTAAGGTATGTTCACAGGGGTTTGGGAGTTGTAAACTCGGTAATGATCACCTCCGCAGGTTCACCTACGGAA,Nectriaceae_sp|HM776425|SH207112.07FU|reps|k__Fungi;p__Ascomycota;c__Sordariomycetes;o__Hypocreales;f__Nectriaceae;g__unidentified;s__Nectriaceae_sp,99.346,459,k__Fungi;p__Ascomycota;c__Sordariomycetes;o__Hypocreales;f__Nectriaceae;g__unidentified;s__Nectriaceae_sp,Nectriaceae_sp,unidentified,91.929,NR_111606.1 Fusarium sublunatum CBS 189.34 ITS region; from TYPE material,Fusarium_sublunatum,Fusarium,508,Fusarium_sublunatum,Fusarium,91.929,508,501,Nectriaceae,Hypocreales,Sordariomycetes,Ascomycota,111R26,R,AMM,bengal